Target
Poly [ADP-ribose] polymerase 2
Ligand
BDBM167422
Substrate
Meas. Tech.
Displacement Assay
Kd
500±n/a nM
Citation
 Papeo, GMBorghi, DCaruso, MPosteri, HKrasavin, MY 3-Oxo-2,3-dihydro-1H-indazole-4-carboxamide derivatives as PARP-1 inhibitors US Patent  US9073893 Publication Date 7/7/2015 
Target
Name:
Poly [ADP-ribose] polymerase 2
Synonyms:
(ARTD2 or PARP2) ADPRTL2 PARP2_HUMAN Poly [ADP-ribose] polymerase 2 (PARP2)
Type:
Enzyme
Mol. Mass.:
66225.70
Organism:
Homo sapiens (Human)
Description:
Q9UGN5
Residue:
583
  
Inhibitor
Name:
BDBM167422
Synonyms:
US9073893, 22
Type:
Small organic molecule
Emp. Form.:
C20H27FN4O2
Mol. Mass.:
374.4524
SMILES:
Cn1n(C2CCN(CC2)C2CCCCC2)c(=O)c2c(cc(F)cc12)C(N)=O
: