Target
Platelet-derived growth factor receptor beta
Ligand
BDBM167956
Substrate
Meas. Tech.
VEGFR2 Kinase Assay
pH
7.2±n/a
Temperature
298.15±n/a K
IC50
74.32±0.0 nM
Comments
extracted
Citation
 Yin, YSha, SWang, YTWu, XWang, SFQiao, FLv, PCZhu, HL Discovery of new 4-alkoxyquinazoline-based derivatives as potent VEGFR2 inhibitors. Chem Biol Drug Des 86:1323-9 (2015)  
Target
Name:
Platelet-derived growth factor receptor beta
Synonyms:
Beta-type platelet-derived growth factor receptor CD140b antigen PDGF Receptor Substrate PDGFR PDGFR-1 PDGFRB PGFRB_HUMAN Platelet-derived growth factor receptor 1 Platelet-derived growth factor receptor beta (PDGFR-beta) Platelet-derived growth factor receptor beta (PDGFRbeta) | VHL/PDGFRB
Type:
Enzyme
Mol. Mass.:
123922.25
Organism:
Homo sapiens (Human)
Description:
P09619
Residue:
1106
  
Inhibitor
Name:
BDBM167956
Synonyms:
1-(4-(3,4-Dichlorophenyl)piperazin-1-yl)-3-(quinazolin-4-yloxy)propan-2-ol (3l)
Type:
Small organic molecule
Emp. Form.:
C21H22Cl2N4O2
Mol. Mass.:
433.331
SMILES:
OC(COc1ncnc2ccccc12)CN1CCN(CC1)c1ccc(Cl)c(Cl)c1
: