Target
Platelet-derived growth factor receptor beta
Ligand
BDBM167957
Substrate
Meas. Tech.
VEGFR2 Kinase Assay
pH
7.2±n/a
Temperature
298.15±n/a K
IC50
101.87±0.0 nM
Comments
extracted
Citation
 Yin, YSha, SWang, YTWu, XWang, SFQiao, FLv, PCZhu, HL Discovery of new 4-alkoxyquinazoline-based derivatives as potent VEGFR2 inhibitors. Chem Biol Drug Des 86:1323-9 (2015)  
Target
Name:
Platelet-derived growth factor receptor beta
Synonyms:
Beta-type platelet-derived growth factor receptor CD140b antigen PDGF Receptor Substrate PDGFR PDGFR-1 PDGFRB PGFRB_HUMAN Platelet-derived growth factor receptor 1 Platelet-derived growth factor receptor beta (PDGFR-beta) Platelet-derived growth factor receptor beta (PDGFRbeta) | VHL/PDGFRB
Type:
Enzyme
Mol. Mass.:
123922.25
Organism:
Homo sapiens (Human)
Description:
P09619
Residue:
1106
  
Inhibitor
Name:
BDBM167957
Synonyms:
1-(4-(2,4-Dimethylphenyl)piperazin-1-yl)-3-(quinazolin-4-yloxy)propan-2-ol (3m)
Type:
Small organic molecule
Emp. Form.:
C23H28N4O2
Mol. Mass.:
392.494
SMILES:
Cc1ccc(N2CCN(CC(O)COc3ncnc4ccccc34)CC2)c(C)c1
: