Target
Ribosomal protein S6 kinase alpha-3
Ligand
BDBM167983
Substrate
Meas. Tech.
Kinase Glo Assay
pH
7.5±n/a
IC50
23±n/a nM
Comments
extracted
Citation
 Boyer, SJBurke, JGuo, XKirrane, Jr., TMSnow, RJZhang, Y Heterocyclic compounds containing a pyrrolopyridine or benzimidazole core US Patent  US9073926 Publication Date 7/7/2015 
Target
Name:
Ribosomal protein S6 kinase alpha-3
Synonyms:
90 kDa ribosomal protein S6 kinase 3 ISPK1 MAP kinase-activated protein kinase 1b RPS6KA3 RSK2 Ribosomal protein S6 kinase Ribosomal protein S6 kinase alpha-3 (RSK2) S6K-alpha 3 p90 ribosomal s6 kinase (RSK2) p90RSK | pp90RSK2
Type:
Serine/threonine-protein kinase
Mol. Mass.:
83740.03
Organism:
Homo sapiens (Human)
Description:
The human RSK2 sequence differed from the Genbank entry NM_004586 at one residue, V45G. The protein was cloned and purified from baculovirus expression system.
Residue:
740
  
Inhibitor
Name:
BDBM167983
Synonyms:
US9073926, 17
Type:
Small organic molecule
Emp. Form.:
C20H19N7O2
Mol. Mass.:
389.4106
SMILES:
CCn1c(NC(=O)c2ccc3nc4C(=O)NCCCn4c3c2)nc2cccnc12
: