Target
Atrial natriuretic peptide receptor 3
Ligand
BDBM287929
Substrate
Meas. Tech.
Vasoreactivity in Rat Mesenteric Arteries In Vitro
EC50
>50000±n/a nM
Citation
 Selwood, DHobbs, A Agents for use in the treatment of cardiovascular and inflammatory diseases structurally based on 4(1 H)-quinolone US Patent  US10087144 Publication Date 10/2/2018 
Target
Name:
Atrial natriuretic peptide receptor 3
Synonyms:
ANP-C ANPRC Atrial natriuretic peptide C-type receptor Atrial natriuretic peptide receptor 3 EF-2 Npr3
Type:
PROTEIN
Mol. Mass.:
59812.13
Organism:
Mus musculus
Description:
ChEMBL_35004
Residue:
536
  
Inhibitor
Name:
BDBM287929
Synonyms:
US10087144, Compound 188
Type:
Small organic molecule
Emp. Form.:
C23H23BrN2O4
Mol. Mass.:
471.344
SMILES:
CC(C)CC(NC(=O)c1cn(Cc2ccccc2)c2ccc(Br)cc2c1=O)C(O)=O
: