Target
Oxysterols receptor LXR-alpha
Ligand
BDBM168091
Substrate
Meas. Tech.
Radioligand Binding Assay
Temperature
298.15±n/a K
Ki
236±n/a nM
Comments
extracted
Citation
 Leftheris, KZhuang, L Liver X receptor modulators US Patent  US9073931 Publication Date 7/7/2015 
Target
Name:
Oxysterols receptor LXR-alpha
Synonyms:
LXRA Liver X receptor alpha Liver X receptor alpha (NR1H3) NR1H3 Nuclear orphan receptor LXR-alpha | Nuclear receptor subfamily 1 group H member 3
Type:
Enzyme Catalytic Domain
Mol. Mass.:
50403.85
Organism:
Homo sapiens (Human)
Description:
Q13133
Residue:
447
  
Inhibitor
Name:
BDBM168091
Synonyms:
US9073931, E11a | US9073931, E11b
Type:
Small organic molecule
Emp. Form.:
C24H30F3N5O4S
Mol. Mass.:
541.586
SMILES:
CCCC(O)c1cnc(nc1C(F)(F)F)N1CCn2c(nc3cc(CO)c(cc23)S(C)(=O)=O)[C@H]1C(C)C
: