Target
Oxysterols receptor LXR-alpha
Ligand
BDBM168080
Substrate
Meas. Tech.
Radioligand Binding Assay
Temperature
298.15±n/a K
Ki
3240±n/a nM
Comments
extracted
Citation
 Leftheris, KZhuang, L Liver X receptor modulators US Patent  US9073931 Publication Date 7/7/2015 
Target
Name:
Oxysterols receptor LXR-alpha
Synonyms:
LXRA Liver X receptor alpha Liver X receptor alpha (NR1H3) NR1H3 Nuclear orphan receptor LXR-alpha | Nuclear receptor subfamily 1 group H member 3
Type:
Enzyme Catalytic Domain
Mol. Mass.:
50403.85
Organism:
Homo sapiens (Human)
Description:
Q13133
Residue:
447
  
Inhibitor
Name:
BDBM168080
Synonyms:
US9073931, E27b | US9073931, E7b
Type:
Small organic molecule
Emp. Form.:
C23H28F3N5O4S
Mol. Mass.:
527.56
SMILES:
CC(C)[C@@H]1N(CCn2c1nc1cc(CO)c(cc21)S(C)(=O)=O)c1ncc(c(n1)C(F)(F)F)C(C)(C)O
: