Target
Oxysterols receptor LXR-beta
Ligand
BDBM168109
Substrate
Meas. Tech.
Radioligand Binding Assay
Temperature
298.15±n/a K
Ki
12±n/a nM
Comments
extracted
Citation
 Leftheris, KZhuang, L Liver X receptor modulators US Patent  US9073931 Publication Date 7/7/2015 
Target
Name:
Oxysterols receptor LXR-beta
Synonyms:
LXRB Liver X, LXR beta NR1H2 Nuclear receptor NER Ubiquitously-expressed nuclear receptor
Type:
Enzyme Catalytic Domain
Mol. Mass.:
50978.79
Organism:
Homo sapiens (Human)
Description:
P55055
Residue:
460
  
Inhibitor
Name:
BDBM168109
Synonyms:
US9073931, E22a
Type:
Small organic molecule
Emp. Form.:
C21H22F3N5O3S
Mol. Mass.:
481.491
SMILES:
CC(C)[C@H]1N(CCn2c1nc1ccc(cc21)S(C)(=O)=O)c1ncc(C(C)=O)c(n1)C(F)(F)F
: