Target
Arachidonate 5-lipoxygenase-activating protein
Ligand
BDBM168991
Substrate
Meas. Tech.
Homogeneous Time Resolved Fluorescence Assay
Ki
1±n/a nM
Citation
 Bacani, GMEccles, WFitzgerald, AEGoldberg, SDHack, MDHawryluk, NAJones, WMKeith, JMKrawczuk, PLebsack, ADLee-Dutra, ALiu, JMcClure, KJMeduna, SPPippel, DJRosen, MDSales, ZS Flap modulators US Patent  US9079866 Publication Date 7/14/2015 
Target
Name:
Arachidonate 5-lipoxygenase-activating protein
Synonyms:
5-lipoxygenase activating protein 5-lipoxygenase/FLAP ALOX5AP MK-886-binding protein
Type:
Enzyme
Mol. Mass.:
18159.90
Organism:
Homo sapiens (Human)
Description:
P20292
Residue:
161
  
Inhibitor
Name:
BDBM168991
Synonyms:
US9079866, 392 US9884878, Compound 392
Type:
Small organic molecule
Emp. Form.:
C23H22FN3O5S2
Mol. Mass.:
503.566
SMILES:
Fc1cc(ccc1-c1cnc2NCCOc2c1)-c1ccccc1S(=O)(=O)N1CCS(=O)(=O)CC1
: