Target
Neuraminidase
Ligand
BDBM5197
Substrate
BDBM4702
Meas. Tech.
Neuraminidase Inhibition Assay
pH
7.5±n/a
Temperature
295.15±n/a K
Ki
350±n/a nM
Citation
 Maring, CJStoll, VSZhao, CSun, MKrueger, ACStewart, KDMadigan, DLKati, WMXu, YCarrick, RJMontgomery, DAKempf-Grote, AMarsh, KCMolla, ASteffy, KRSham, HLLaver, WGGu, YGKempf, DJKohlbrenner, WE Structure-based characterization and optimization of novel hydrophobic binding interactions in a series of pyrrolidine influenza neuraminidase inhibitors. J Med Chem 48:3980-90 (2005)  
Target
Name:
Neuraminidase
Synonyms:
Influenza A Virus Neuraminidase NRAM_I67A0 | Neuraminidase A
Type:
Enzyme
Mol. Mass.:
52132.25
Organism:
Influenza A virus (A/Tokyo/3/67(H2N2))
Description:
P06820
Residue:
469
  
Inhibitor
Name:
BDBM5197
Synonyms:
(+/-)-(2R,4R,5R,1 S)-5-(1 -Acetylamino-3 -methyl-butyl)-4-(thiazol-4-yl)-pyrrolidine-2-carboxylic acid dihydrochloride salt Pyrrolidine deriv. 24
Type:
Small organic molecule
Emp. Form.:
C15H23N3O3S
Mol. Mass.:
325.426
SMILES:
[H][C@]1(N[C@H](C[C@H]1c1cscn1)C(O)=O)[C@H](CC(C)C)NC(C)=O
:
Substrate
Name:
BDBM4702
Synonyms:
(2R,4S,5R,6R)-5-acetamido-4-hydroxy-2-[(4-methyl-2-oxo-2H-chromen-7-yl)oxy]-6-[(1R,2R)-1,2,3-trihydroxypropyl]oxane-2-carboxylic acid neuraminidase substrate
Type:
Small organic molecule
Emp. Form.:
C21H25NO11
Mol. Mass.:
467.4233
SMILES:
CC(=O)N[C@@H]1[C@@H](O)C[C@](Oc2ccc3c(C)cc(=O)oc3c2)(O[C@H]1[C@H](O)[C@H](O)CO)C(O)=O
: