Target
Acetylcholinesterase
Ligand
BDBM170162
Substrate
Meas. Tech.
AChE and BChE Inhibition Assay
pH
8±n/a
Temperature
298.15±n/a K
IC50
>1.00e+5±n/a nM
Comments
extracted
Citation
 Mohammadi-Khanaposhtani, MMahdavi, MSaeedi, MSabourian, RSafavi, MKhanavi, MForoumadi, AShafiee, AAkbarzadeh, T Design, Synthesis, Biological Evaluation, and Docking Study of Acetylcholinesterase Inhibitors: New Acridone-1,2,4-oxadiazole-1,2,3-triazole Hybrids. Chem Biol Drug Des 86:1425-32 (2015)  
Target
Name:
Acetylcholinesterase
Synonyms:
ACES_ELEEL Acetylcholinesterase (EeAChE) | ache
Type:
Enzyme
Mol. Mass.:
71812.79
Organism:
Electrophorus electricus (Electric eel)
Description:
Residue:
633
  
Inhibitor
Name:
BDBM170162
Synonyms:
2-Chloro-10-((1-((3-(4-methoxyphenyl)-1,2,4-oxadiazol-5-yl)methyl)-1H-1,2,3-triazol-4-yl)methyl)acridin-9(10H)-one (10m)
Type:
Small organic molecule
Emp. Form.:
C26H19ClN6O3
Mol. Mass.:
498.92
SMILES:
COc1ccc(cc1)-c1noc(Cn2cc(Cn3c4ccccc4c(=O)c4cc(Cl)ccc34)nn2)n1
: