Target
Sodium-dependent serotonin transporter
Ligand
BDBM60514
Substrate
Meas. Tech.
Binding Assay
pH
7.4±n/a
Ki
5.2±n/a nM
Comments
extracted
Citation
 Molino, BFLiu, SGuzzo, PRBeck, JP Aryl- and heteroaryl-substituted tetrahydroisoquinolines and use thereof to block reuptake of norepinephrine, dopamine, and serotonin US Patent  US9085531 Publication Date 7/21/2015 
Target
Name:
Sodium-dependent serotonin transporter
Synonyms:
5-HT Transporter 5HTT SC6A4_HUMAN SLC6A4 Serotonin transporter (5HTT) Sodium-dependent serotonin transporter (SERT) | Solute carrier family 6 member 4
Type:
Multi-pass membrane protein
Mol. Mass.:
70322.51
Organism:
Homo sapiens (Human)
Description:
P31645
Residue:
630
  
Inhibitor
Name:
BDBM60514
Synonyms:
US9085531, 142
Type:
Emp. Form.:
C25H28N2O
Mol. Mass.:
372.5026
SMILES:
CC1NOC(C)C1c1ccc2C(CN(C)Cc2c1)c1ccc2ccccc2c1
: