Target
Alpha-synuclein
Ligand
BDBM170556
Substrate
Meas. Tech.
Competitive Binding Assay
pH
7.4±n/a
Ki
135±n/a nM
Comments
extracted
Citation
 Luke, EAYadon, MCCummings, JHudson, FMLake, THu, QCam, JSnow, AD Compounds for the treatment of neurodegenerative diseases US Patent  US9085549 Publication Date 7/21/2015 
Target
Name:
Alpha-synuclein
Synonyms:
NACP SNCA | SYUA_HUMAN
Type:
Protein
Mol. Mass.:
14451.42
Organism:
Homo sapiens (Human)
Description:
P37840
Residue:
140
  
Inhibitor
Name:
BDBM170556
Synonyms:
US9085549, 66
Type:
Small organic molecule
Emp. Form.:
C14H9BrN2O4S
Mol. Mass.:
381.201
SMILES:
Oc1ccc(cc1O)-c1nnc(s1)-c1cc(O)c(O)cc1Br
: