Target
Alpha-synuclein
Ligand
BDBM170562
Substrate
Meas. Tech.
Competitive Binding Assay
pH
7.4±n/a
Ki
219±n/a nM
Comments
extracted
Citation
 Luke, EAYadon, MCCummings, JHudson, FMLake, THu, QCam, JSnow, AD Compounds for the treatment of neurodegenerative diseases US Patent  US9085549 Publication Date 7/21/2015 
Target
Name:
Alpha-synuclein
Synonyms:
NACP SNCA | SYUA_HUMAN
Type:
Protein
Mol. Mass.:
14451.42
Organism:
Homo sapiens (Human)
Description:
P37840
Residue:
140
  
Inhibitor
Name:
BDBM170562
Synonyms:
US9085549, 76
Type:
Small organic molecule
Emp. Form.:
C15H11IN2O4S
Mol. Mass.:
442.228
SMILES:
COc1cc(ccc1O)-c1nnc(s1)-c1cc(O)c(O)cc1I
: