Target
Sodium-dependent dopamine transporter
Ligand
BDBM287933
Substrate
Meas. Tech.
Assay for Dopamine Reuptake Inhibition
pH
7.4±n/a
EC50
380±n/a nM
Comments
extracted
Citation
 Ananthan, SRothman, RB Quinazolines as biogenic amine transport modulators US Patent  US10087148 Publication Date 10/2/2018 
Target
Name:
Sodium-dependent dopamine transporter
Synonyms:
DA transporter DAT1 Dopamine transporter protein (DAT) SC6A3_HUMAN Sodium-dependent dopamine transporter Solute carrier family 6 member 3
Type:
Multi-pass membrane protein
Mol. Mass.:
68497.11
Organism:
Homo sapiens (Human)
Description:
Q01959
Residue:
620
  
Inhibitor
Name:
BDBM287933
Synonyms:
N-(2-(6-chloropyridin-2-yl)-2- phenylethyl)-2-(p-tolyl)quinazolin-4- amine | US10087148, Example 1
Type:
Small organic molecule
Emp. Form.:
C28H23ClN4
Mol. Mass.:
450.962
SMILES:
Cc1ccc(cc1)-c1nc(NCC(c2ccccc2)c2cccc(Cl)n2)c2ccccc2n1
: