Target
Sodium-dependent dopamine transporter
Ligand
BDBM287973
Substrate
Meas. Tech.
Assay for Dopamine Reuptake Inhibition
pH
7.4±n/a
EC50
40.0±8 nM
Comments
extracted
Citation
 Ananthan, SRothman, RB Quinazolines as biogenic amine transport modulators US Patent  US10087148 Publication Date 10/2/2018 
Target
Name:
Sodium-dependent dopamine transporter
Synonyms:
DA transporter DAT1 Dopamine transporter protein (DAT) SC6A3_HUMAN Sodium-dependent dopamine transporter Solute carrier family 6 member 3
Type:
Multi-pass membrane protein
Mol. Mass.:
68497.11
Organism:
Homo sapiens (Human)
Description:
Q01959
Residue:
620
  
Inhibitor
Name:
BDBM287973
Synonyms:
2-(4-(dimethylamino)phenyl)-N-(1,2- diphenylethyl)quinazolin-4-amine | US10087148, Example 40
Type:
Small organic molecule
Emp. Form.:
C30H28N4
Mol. Mass.:
444.5701
SMILES:
CN(C)c1ccc(cc1)-c1nc(NC(Cc2ccccc2)c2ccccc2)c2ccccc2n1
: