Target
Sodium-dependent dopamine transporter
Ligand
BDBM287975
Substrate
Meas. Tech.
Assay for Dopamine Reuptake Inhibition
pH
7.4±n/a
EC50
71.0±11 nM
Comments
extracted
Citation
 Ananthan, SRothman, RB Quinazolines as biogenic amine transport modulators US Patent  US10087148 Publication Date 10/2/2018 
Target
Name:
Sodium-dependent dopamine transporter
Synonyms:
DA transporter DAT1 Dopamine transporter protein (DAT) SC6A3_HUMAN Sodium-dependent dopamine transporter Solute carrier family 6 member 3
Type:
Multi-pass membrane protein
Mol. Mass.:
68497.11
Organism:
Homo sapiens (Human)
Description:
Q01959
Residue:
620
  
Inhibitor
Name:
BDBM287975
Synonyms:
N-(4-(4-((1,3- diphenylpropyl)amino)quinazolin-2- yl)phenyl)methanesulfonamide | US10087148, Example 42
Type:
Small organic molecule
Emp. Form.:
C30H28N4O2S
Mol. Mass.:
508.634
SMILES:
CS(=O)(=O)Nc1ccc(cc1)-c1nc(NC(CCc2ccccc2)c2ccccc2)c2ccccc2n1
: