Target
Sodium-dependent dopamine transporter
Ligand
BDBM287979
Substrate
Meas. Tech.
Assay for Dopamine Reuptake Inhibition
pH
7.4±n/a
EC50
243±18 nM
Comments
extracted
Citation
 Ananthan, SRothman, RB Quinazolines as biogenic amine transport modulators US Patent  US10087148 Publication Date 10/2/2018 
Target
Name:
Sodium-dependent dopamine transporter
Synonyms:
DA transporter DAT1 Dopamine transporter protein (DAT) SC6A3_HUMAN Sodium-dependent dopamine transporter Solute carrier family 6 member 3
Type:
Multi-pass membrane protein
Mol. Mass.:
68497.11
Organism:
Homo sapiens (Human)
Description:
Q01959
Residue:
620
  
Inhibitor
Name:
BDBM287979
Synonyms:
(1R,2S)-2-(((2-(4- (dimethylamino)phenyl)quinazolin-4- yl)amino)methyl)-N,N-diethyl-1- phenylcyclopropanecarboxamide | US10087148, Example 46
Type:
Small organic molecule
Emp. Form.:
C31H35N5O
Mol. Mass.:
493.6425
SMILES:
CCN(CC)C(=O)[C@@]1(C[C@@H]1CNc1nc(nc2ccccc12)-c1ccc(cc1)N(C)C)c1ccccc1
: