Target
Histone-lysine N-methyltransferase EZH2
Ligand
BDBM172072
Substrate
Meas. Tech.
Enzyme Assay
Temperature
298.15±n/a K
IC50
3.24±n/a nM
Comments
extracted
Citation
 Kuntz, KWChesworth, RDuncan, KWKeilhack, HWarholic, NKlaus, CKnutson, SKWigle, TJSeki, MShirotori, SKawano, S Aryl- or heteroaryl-substituted benzene compounds US Patent  US9090562 Publication Date 7/28/2015 
Target
Name:
Histone-lysine N-methyltransferase EZH2
Synonyms:
ENX-1 EZH2_HUMAN Histone-lysine N-methyltransferase EZH2 Lysine N-methyltransferase 6
Type:
Protein
Mol. Mass.:
85367.84
Organism:
Homo sapiens (Human)
Description:
Q15910
Residue:
746
  
Inhibitor
Name:
BDBM172072
Synonyms:
US10155002, Compound 78 US9090562, 78
Type:
Small organic molecule
Emp. Form.:
C35H46N4O4
Mol. Mass.:
586.7641
SMILES:
CCN(C1CCOCC1)c1cc(cc(C(=O)NCc2c(C)cc(C)[nH]c2=O)c1C)-c1ccc(CN2CCC(O)CC2)cc1
: