Target
C-X-C chemokine receptor type 1
Ligand
BDBM172372
Substrate
Meas. Tech.
In Vitro Assay
IC50
115±n/a nM
Citation
 Musicki, BAubert, JBoiteaux, JClary, LRossio, PSchuppli-Nollet, M Disubstituted 3,4-diamino-3-cyclobutene-1,2-dione compounds for use in the treatment of chemokine-mediated pathologies US Patent  US9090596 Publication Date 7/28/2015 
Target
Name:
C-X-C chemokine receptor type 1
Synonyms:
C-X-C chemokine receptor type 1 (CXCR-1) CMKAR1 CXCR1_HUMAN Interleukin-8 receptor A | Interleukin-8 receptors, CXCR1/CXCR2
Type:
Enzyme
Mol. Mass.:
39803.83
Organism:
Homo sapiens (Human)
Description:
P25024
Residue:
350
  
Inhibitor
Name:
BDBM172372
Synonyms:
US9090596, 53
Type:
Small organic molecule
Emp. Form.:
C25H29ClN4O7S
Mol. Mass.:
565.038
SMILES:
CN1CCN(CC1)S(=O)(=O)c1c(Cl)ccc(Nc2c(N[C@@H](c3ccc(C)o3)C3(C)COC3)c(=O)c2=O)c1O
: