Target
C-C chemokine receptor type 6
Ligand
BDBM172328
Substrate
Meas. Tech.
FLIPR Assay
IC50
5.8±n/a nM
Citation
 Musicki, BAubert, JBoiteaux, JClary, LRossio, PSchuppli-Nollet, M Disubstituted 3,4-diamino-3-cyclobutene-1,2-dione compounds for use in the treatment of chemokine-mediated pathologies US Patent  US9090596 Publication Date 7/28/2015 
Target
Name:
C-C chemokine receptor type 6
Synonyms:
C-C chemokine receptor type 6 CCR6 CKRL3 GPR29 | STRL22
Type:
Enzyme
Mol. Mass.:
42510.84
Organism:
Homo sapiens (Human)
Description:
P51684
Residue:
374
  
Inhibitor
Name:
BDBM172328
Synonyms:
US9090596, 8
Type:
Small organic molecule
Emp. Form.:
C27H29N3O8
Mol. Mass.:
523.5345
SMILES:
COC(=O)[C@H]1CCCN1C(=O)c1cccc(Nc2c(N[C@@H](c3ccc(C)o3)C3(C)COC3)c(=O)c2=O)c1O
: