Target
Hemagglutinin
Ligand
BDBM4934
Substrate
BDBM4702
Meas. Tech.
Neuraminidase Inhibition Assay
pH
6.5±n/a
Temperature
310.15±n/a K
Ki
1±n/a nM
IC50
5±n/a nM
Citation
 Williams, MALew, WMendel, DBTai, CYEscarpe, PALaver, WGStevens, RCKim, CU Structure-activity relationships of carbocyclic influenza neuraminidase inhibitors Bioorg Med Chem Lett 7:1837-42 (1997)    Article 
Target
Name:
Hemagglutinin
Synonyms:
Influenza A Virus Neuraminidase | Neuraminidase A
Type:
Enzyme
Mol. Mass.:
40075.60
Organism:
Influenza A virus (A/Shangdong/9/93(H3N2))
Description:
Q6DM53
Residue:
363
  
Inhibitor
Name:
BDBM4934
Synonyms:
(2R,3R,4S)-4-carbamimidamido-3-acetamido-2-[(1R,2R)-1,2,3-trihydroxypropyl]-3,4-dihydro-2H-pyran-6-carboxylic acid Zanamivir
Type:
Small organic molecule
Emp. Form.:
C12H20N4O7
Mol. Mass.:
332.3098
SMILES:
[H][C@]1([#8]-[#6](=[#6]-[#6@H](\[#7]=[#6](/[#7])-[#7])-[#6@H]1-[#7]-[#6](-[#6])=O)-[#6](-[#8])=O)[#6@H](-[#8])-[#6@H](-[#8])-[#6]-[#8]
:
Substrate
Name:
BDBM4702
Synonyms:
(2R,4S,5R,6R)-5-acetamido-4-hydroxy-2-[(4-methyl-2-oxo-2H-chromen-7-yl)oxy]-6-[(1R,2R)-1,2,3-trihydroxypropyl]oxane-2-carboxylic acid neuraminidase substrate
Type:
Small organic molecule
Emp. Form.:
C21H25NO11
Mol. Mass.:
467.4233
SMILES:
CC(=O)N[C@@H]1[C@@H](O)C[C@](Oc2ccc3c(C)cc(=O)oc3c2)(O[C@H]1[C@H](O)[C@H](O)CO)C(O)=O
: