Target
Sodium-dependent noradrenaline transporter
Ligand
BDBM172728
Substrate
Meas. Tech.
Radioligand Binding Assay
Ki
5.49±n/a nM
Citation
 Bhat, LAdiey, K Methods of using cycloalkylmethylamine derivatives US Patent  US9096515 Publication Date 8/4/2015 
Target
Name:
Sodium-dependent noradrenaline transporter
Synonyms:
Monoamine transporter NET Noradrenaline Transporter (NET) Norepinephrine transporter protein (NET) SLC6A2 Sodium-dependent noradrenaline transporter (NET) | Solute carrier family 6 member 2
Type:
Multi-pass membrane protein
Mol. Mass.:
69337.72
Organism:
Homo sapiens (Human)
Description:
P23975
Residue:
617
  
Inhibitor
Name:
BDBM172728
Synonyms:
US9096515, 33b -Racemic | US9296681, 33b-Racemic
Type:
Small organic molecule
Emp. Form.:
C21H34N2O2
Mol. Mass.:
346.5069
SMILES:
CCOc1ccc(cc1)C1(CC(C)CCNCCCC(N)=O)CCC1
: