Target
Histone deacetylase 3
Ligand
BDBM172755
Substrate
Meas. Tech.
Enzyme Assay
pH
7.4±n/a
IC50
53±n/a nM
Comments
extracted
Citation
 van Duzer, JHMazitschek, R Selective HDAC3 inhibitors US Patent  US9096549 Publication Date 8/4/2015 
Target
Name:
Histone deacetylase 3
Synonyms:
HD3 HDAC3_HUMAN Human HDAC3 SMAP45
Type:
Enzyme
Mol. Mass.:
48829.55
Organism:
Homo sapiens (Human)
Description:
O15379
Residue:
428
  
Inhibitor
Name:
BDBM172755
Synonyms:
US9096549, B
Type:
Small organic molecule
Emp. Form.:
C23H25N5O
Mol. Mass.:
387.4775
SMILES:
Nc1ccccc1NC(=O)c1cnc2c(C3CC3)c(ccc2c1)N1CCNCC1
: