Target
Neuraminidase
Ligand
BDBM5225
Substrate
BDBM4702
Meas. Tech.
Neuraminidase Inhibition Assay
pH
6.5±n/a
Temperature
310.15±n/a K
IC50
65±n/a nM
Citation
 Lew, WWu, HMendel, DBEscarpe, PAChen, XLaver, WGGraves, BJKim, CU A new series of C3-aza carbocyclic influenza neuraminidase inhibitors: synthesis and inhibitory activity. Bioorg Med Chem Lett 8:3321-4 (1998)  
Target
Name:
Neuraminidase
Synonyms:
Influenza B Virus Neuraminidase NRAM_INBLE Neuraminidase B
Type:
Enzyme
Mol. Mass.:
51446.67
Organism:
Influenza B virus (B/Lee/40)
Description:
Residue:
466
  
Inhibitor
Name:
BDBM5225
Synonyms:
(3R,4R,5S)-5-amino-4-acetamido-3-[methyl(propyl)amino]cyclohex-1-ene-1-carboxylic acid | C3-Aza Carbocyclic Analogue 3a
Type:
Small organic molecule
Emp. Form.:
C13H23N3O3
Mol. Mass.:
269.34
SMILES:
CCCN(C)[C@@H]1C=C(C[C@H](N)[C@H]1NC(C)=O)C(O)=O
:
Substrate
Name:
BDBM4702
Synonyms:
(2R,4S,5R,6R)-5-acetamido-4-hydroxy-2-[(4-methyl-2-oxo-2H-chromen-7-yl)oxy]-6-[(1R,2R)-1,2,3-trihydroxypropyl]oxane-2-carboxylic acid neuraminidase substrate
Type:
Small organic molecule
Emp. Form.:
C21H25NO11
Mol. Mass.:
467.4233
SMILES:
CC(=O)N[C@@H]1[C@@H](O)C[C@](Oc2ccc3c(C)cc(=O)oc3c2)(O[C@H]1[C@H](O)[C@H](O)CO)C(O)=O
: