Target
Epidermal growth factor receptor
Ligand
BDBM173427
Substrate
Meas. Tech.
Inhibition Assay
IC50
3±n/a nM
Citation
 Yang, SWei, Y Arylamino purine derivatives, preparation method and pharmaceutical use thereof US Patent  US9096601 Publication Date 8/4/2015 
Target
Name:
Epidermal growth factor receptor
Synonyms:
EGF Receptor Substrate EGFR_HUMAN ERBB1 Epidermal Growth Factor Receptor erbB-1 Epidermal growth factor receptor (EGFR) HER1 Proto-oncogene c-ErbB-1 Tyrosine-Protein Kinase ErbB-1
Type:
Receptor Kinase Domain
Mol. Mass.:
134279.59
Organism:
Homo sapiens (Human)
Description:
P00533
Residue:
1210
  
Inhibitor
Name:
BDBM173427
Synonyms:
US9096601, 8-1
Type:
Small organic molecule
Emp. Form.:
C26H30N9O
Mol. Mass.:
484.5761
SMILES:
CC(C)n1c(Nc2ccccc2)nc2cnc(Nc3ccc(cc3)C(=O)N[N]3=CCN(C)CC3)nc12
: