Target
Epidermal growth factor receptor [L858R]
Ligand
BDBM173427
Substrate
Meas. Tech.
Inhibition Assay
IC50
8±n/a nM
Citation
 Yang, SWei, Y Arylamino purine derivatives, preparation method and pharmaceutical use thereof US Patent  US9096601 Publication Date 8/4/2015 
Target
Name:
Epidermal growth factor receptor [L858R]
Synonyms:
EGFR EGFR_HUMAN ERBB1 Epidermal growth factor receptor (L858R) HER1
Type:
Mol. Mass.:
134323.62
Organism:
Homo sapiens (Human)
Description:
P00533[L858R]
Residue:
1210
  
Inhibitor
Name:
BDBM173427
Synonyms:
US9096601, 8-1
Type:
Small organic molecule
Emp. Form.:
C26H30N9O
Mol. Mass.:
484.5761
SMILES:
CC(C)n1c(Nc2ccccc2)nc2cnc(Nc3ccc(cc3)C(=O)N[N]3=CCN(C)CC3)nc12
: