Target
Epidermal growth factor receptor [L858R]
Ligand
BDBM173429
Substrate
Meas. Tech.
Inhibition Assay
IC50
60±n/a nM
Citation
 Yang, SWei, Y Arylamino purine derivatives, preparation method and pharmaceutical use thereof US Patent  US9096601 Publication Date 8/4/2015 
Target
Name:
Epidermal growth factor receptor [L858R]
Synonyms:
EGFR EGFR_HUMAN ERBB1 Epidermal growth factor receptor (L858R) HER1
Type:
Mol. Mass.:
134323.62
Organism:
Homo sapiens (Human)
Description:
P00533[L858R]
Residue:
1210
  
Inhibitor
Name:
BDBM173429
Synonyms:
US9096601, 8-3
Type:
Small organic molecule
Emp. Form.:
C28H32FN10O2
Mol. Mass.:
559.6179
SMILES:
CC(C)n1c(Nc2cccc(NC(C)=O)c2)nc2cnc(Nc3ccc(cc3F)C(=O)N[N]3=CCN(C)CC3)nc12
: