Target
Epidermal growth factor receptor [L858R]
Ligand
BDBM173444
Substrate
Meas. Tech.
Inhibition Assay
IC50
5±n/a nM
Citation
 Yang, SWei, Y Arylamino purine derivatives, preparation method and pharmaceutical use thereof US Patent  US9096601 Publication Date 8/4/2015 
Target
Name:
Epidermal growth factor receptor [L858R]
Synonyms:
EGFR EGFR_HUMAN ERBB1 Epidermal growth factor receptor (L858R) HER1
Type:
Mol. Mass.:
134323.62
Organism:
Homo sapiens (Human)
Description:
P00533[L858R]
Residue:
1210
  
Inhibitor
Name:
BDBM173444
Synonyms:
US9096601, 8-18
Type:
Small organic molecule
Emp. Form.:
C26H32N8O
Mol. Mass.:
472.5853
SMILES:
COc1ccc(Nc2nc3cnc(Nc4ccc(cc4)N4CCN(C)CC4)nc3n2C(C)C)cc1
: