Target
Dihydroorotate dehydrogenase (quinone), mitochondrial
Ligand
BDBM173497
Substrate
Meas. Tech.
Inhibiton Assay
pH
8±n/a
IC50
130±n/a nM
Comments
extracted
Citation
 Rathod, PKFloyd, DBurrows, JMarwaha, AGujjar, RCoteron-Lopez, JPhillips, MCharman, SAMatthews, D Antimalarial agents that are inhibitors of dihydroorotate dehydrogenase US Patent  US9238653 Publication Date 1/19/2016 
Target
Name:
Dihydroorotate dehydrogenase (quinone), mitochondrial
Synonyms:
DHOdehase Dihydroorotate dehydrogenase homolog PYRD_PLAF7
Type:
Enzyme
Mol. Mass.:
65581.88
Organism:
Plasmodium falciparum (isolate 3D7)
Description:
Q08210
Residue:
569
  
Inhibitor
Name:
BDBM173497
Synonyms:
US9238653, Table 5, Compound 21
Type:
Small organic molecule
Emp. Form.:
C16H16N4
Mol. Mass.:
264.325
SMILES:
Cc1cc(Nc2ccc3CCCc3c2)n2ccnc2n1
: