Target
Prostaglandin G/H synthase 1
Ligand
BDBM173513
Substrate
Meas. Tech.
In vitro Cyclooxygenase (COX) Inhibition Assay
IC50
2.25e+4±n/a nM
Citation
 Abdellatif, KRElshemy, HAAzoz, AA 1-(4-Methane(amino)sulfonylphenyl)-3-(4-substituted-phenyl)-5-(4-trifluoromethylphenyl)-1H-2-pyrazolines/pyrazoles as potential anti-inflammatory agents. Bioorg Chem 63:13-23 (2015)  
Target
Name:
Prostaglandin G/H synthase 1
Synonyms:
COX1 Cyclooxygenase-1 (COX-1) PTGS1 | Prostaglandin G/H synthase (cyclooxygenase)
Type:
Protein
Mol. Mass.:
68868.60
Organism:
Ovis aries (Sheep)
Description:
Residue:
600
  
Inhibitor
Name:
BDBM173513
Synonyms:
1-(4-Aminosulfonylphenyl)-3-(p-tolyl)-5-(4-trifluoromethylphenyl)-4,5-dihydro-1H-pyrazole (14h)
Type:
Small organic molecule
Emp. Form.:
C23H20F3N3O2S
Mol. Mass.:
459.484
SMILES:
Cc1ccc(cc1)C1=NN(C(C1)c1ccc(cc1)C(F)(F)F)c1ccc(cc1)S(N)(=O)=O
: