Target
Prostaglandin G/H synthase 1
Ligand
BDBM173522
Substrate
Meas. Tech.
In vitro Cyclooxygenase (COX) Inhibition Assay
IC50
1.43e+4±n/a nM
Citation
 Abdellatif, KRElshemy, HAAzoz, AA 1-(4-Methane(amino)sulfonylphenyl)-3-(4-substituted-phenyl)-5-(4-trifluoromethylphenyl)-1H-2-pyrazolines/pyrazoles as potential anti-inflammatory agents. Bioorg Chem 63:13-23 (2015)  
Target
Name:
Prostaglandin G/H synthase 1
Synonyms:
COX1 Cyclooxygenase-1 (COX-1) PTGS1 | Prostaglandin G/H synthase (cyclooxygenase)
Type:
Protein
Mol. Mass.:
68868.60
Organism:
Ovis aries (Sheep)
Description:
Residue:
600
  
Inhibitor
Name:
BDBM173522
Synonyms:
3-(4-Fluorophenyl)-1-(4-methanesulfonylphenyl)-5-(4-trifluoromethylphenyl)-1H-pyrazole (15e)
Type:
Small organic molecule
Emp. Form.:
C23H16F4N2O2S
Mol. Mass.:
460.444
SMILES:
CS(=O)(=O)c1ccc(cc1)-n1nc(cc1-c1ccc(cc1)C(F)(F)F)-c1ccc(F)cc1
: