Target
Genome polyprotein
Ligand
BDBM288012
Substrate
Meas. Tech.
HCV Replicon Luciferase Assay
EC50
>1000±n/a nM
Citation
 Wang, TYin, ZKadow, JF Benzofurans substituted with secondary benzamide as HCV inhibitors US Patent  US10087167 Publication Date 10/2/2018 
Target
Name:
Genome polyprotein
Synonyms:
Genome polyprotein Hepatitis C virus polyprotein RNA-dependent RNA polymerase (NS5B)
Type:
Protein
Mol. Mass.:
327266.82
Organism:
Hepatitis C virus (HCV)
Description:
P26664
Residue:
3011
  
Inhibitor
Name:
BDBM288012
Synonyms:
US10087167, Compound 4021
Type:
Small organic molecule
Emp. Form.:
C31H28F2N4O5S
Mol. Mass.:
606.64
SMILES:
CNC(=O)c1c(oc2cc(N(CCF)S(C)(=O)=O)c(cc12)-c1cccc(c1)C(=O)N1CC[C@H](C1)C#N)-c1ccc(F)cc1
: