Target
Non-secretory ribonuclease
Ligand
BDBM173619
Substrate
Meas. Tech.
Ribonuclease Activity Assay
Temperature
303.15±n/a K
Ki
1.0801e+6± 1.60e+5 nM
IC50
1.4628e+6± 1.098e+5 nM
Comments
extracted
Citation
 Chatzileontiadou, DSParmenopoulou, VManta, SKantsadi, ALKylindri, PGriniezaki, MKontopoulou, FTelopoulou, AProkova, HPanagopoulos, DBoix, EBalatsos, NAKomiotis, DLeonidas, DD Triazole double-headed ribonucleosides as inhibitors of eosinophil derived neurotoxin. Bioorg Chem 63:152-65 (2015)  
Target
Name:
Non-secretory ribonuclease
Synonyms:
EDN Non-secretory ribonuclease RNASE2 RNS2
Type:
Protein
Mol. Mass.:
18364.09
Organism:
Homo sapiens (Human)
Description:
Residue:
161
  
Inhibitor
Name:
BDBM173619
Synonyms:
5-chloro-1-[(2R,5R)-3,4-dihydroxy-5-(hydroxymethyl)oxolan-2-yl]-1,2,3,4-tetrahydropyrimidine-2,4-dione (V)
Type:
Small organic molecule
Emp. Form.:
C9H11ClN2O6
Mol. Mass.:
278.646
SMILES:
OC[C@H]1O[C@H](C(O)[C@H]1O)n1cc(Cl)c(=O)[nH]c1=O
: