Target
Fatty-acid amide hydrolase 1 [30-579]
Ligand
BDBM173915
Substrate
Meas. Tech.
Enzyme Assay
Temperature
310.15±n/a K
Ki
7±n/a nM
IC50
24±n/a nM
Comments
extracted
Citation
 Makriyannis, ANikas, SPAlapafuja, SOShukla, VG Fatty acid amide hydrolase inhibitors US Patent  US9102622 Publication Date 8/11/2015 
Target
Name:
Fatty-acid amide hydrolase 1 [30-579]
Synonyms:
Anandamide amidohydrolase 1 Faah Fatty Acid Amide Hydrolase Fatty-acid amide hydrolase (FAAH) Fatty-acid amide hydrolase 1 (FAAH) Oleamide hydrolase 1
Type:
Single-pass membrane protein; homodimer
Mol. Mass.:
60474.00
Organism:
Rattus norvegicus (rat)
Description:
P97612 (aa 30-579)
Residue:
550
  
Inhibitor
Name:
BDBM173915
Synonyms:
US9102622, 89.11
Type:
Small organic molecule
Emp. Form.:
C24H23F2NO3
Mol. Mass.:
411.4411
SMILES:
FC(F)(CCCCOc1cccc(OCc2ccccc2)c1)C(=O)c1cccnc1
: