Target
TRAF2 and NCK-interacting protein kinase
Ligand
BDBM174016
Substrate
Meas. Tech.
Kinase Assay
pH
7.5±n/a
Temperature
298.15±n/a K
IC50
5.7±n/a nM
Comments
extracted
Citation
 Sawa, MMoriyama, HYamada, TShitashige, MKawase, YUno, Y Bicyclic thiazole compounds US Patent  US9102637 Publication Date 8/11/2015 
Target
Name:
TRAF2 and NCK-interacting protein kinase
Synonyms:
KIAA0551 TNIK_HUMAN TRAF2- and NCK-interacting kinase
Type:
Protein
Mol. Mass.:
154954.98
Organism:
Homo sapiens (Human)
Description:
Q9UKE5
Residue:
1360
  
Inhibitor
Name:
BDBM174016
Synonyms:
US9102637, 51
Type:
Small organic molecule
Emp. Form.:
C24H24N6O3S2
Mol. Mass.:
508.616
SMILES:
CN(c1nc(C(N)=O)c(NC(=O)c2csc(CN3CCOCC3)c2)s1)c1ccc2ncccc2c1
: