Target
TRAF2 and NCK-interacting protein kinase
Ligand
BDBM174185
Substrate
Meas. Tech.
Kinase Assay
pH
7.5±n/a
Temperature
298.15±n/a K
IC50
3±n/a nM
Comments
extracted
Citation
 Sawa, MMoriyama, HYamada, TShitashige, MKawase, YUno, Y Bicyclic thiazole compounds US Patent  US9102637 Publication Date 8/11/2015 
Target
Name:
TRAF2 and NCK-interacting protein kinase
Synonyms:
KIAA0551 TNIK_HUMAN TRAF2- and NCK-interacting kinase
Type:
Protein
Mol. Mass.:
154954.98
Organism:
Homo sapiens (Human)
Description:
Q9UKE5
Residue:
1360
  
Inhibitor
Name:
BDBM174185
Synonyms:
US9102637, 220
Type:
Small organic molecule
Emp. Form.:
C26H26N6O2S
Mol. Mass.:
486.589
SMILES:
N[C@H]1CCN(Cc2ccc(cc2)C(=O)Nc2sc(Nc3ccc4ccccc4c3)nc2C(N)=O)C1
: