Target
TRAF2 and NCK-interacting protein kinase
Ligand
BDBM174224
Substrate
Meas. Tech.
Kinase Assay
pH
7.5±n/a
Temperature
298.15±n/a K
IC50
5.5±n/a nM
Comments
extracted
Citation
 Sawa, MMoriyama, HYamada, TShitashige, MKawase, YUno, Y Bicyclic thiazole compounds US Patent  US9102637 Publication Date 8/11/2015 
Target
Name:
TRAF2 and NCK-interacting protein kinase
Synonyms:
KIAA0551 TNIK_HUMAN TRAF2- and NCK-interacting kinase
Type:
Protein
Mol. Mass.:
154954.98
Organism:
Homo sapiens (Human)
Description:
Q9UKE5
Residue:
1360
  
Inhibitor
Name:
BDBM174224
Synonyms:
US9102637, 259
Type:
Small organic molecule
Emp. Form.:
C24H19N7O2S
Mol. Mass.:
469.518
SMILES:
NC(=O)c1nc(Nc2cccc3cccnc23)sc1NC(=O)c1ccc(Cn2ccnc2)cc1
: