Target
Rho-associated protein kinase 2
Ligand
BDBM148408
Substrate
Meas. Tech.
Biochemical Assay
pH
7.5±n/a
Temperature
298.15±n/a K
IC50
<100±n/a nM
Comments
extracted
Citation
 Boland, SBourin, ADefert, OLeysen, D Pyridine derivatives as soft rock inhibitors US Patent  US9682963 Publication Date 6/20/2017 
Target
Name:
Rho-associated protein kinase 2
Synonyms:
KIAA0619 ROCK2 Rho kinase 2 (ROCKII) Rho-associated protein kinase 2 (ROCK2) Rho-associated protein kinase 2/Transforming protein RhoA Rho-associated, coiled-coil-containing protein kinase II p164 ROCK-2
Type:
Protein
Mol. Mass.:
160885.43
Organism:
Homo sapiens (Human)
Description:
O75116
Residue:
1388
  
Inhibitor
Name:
BDBM148408
Synonyms:
US9682963, 2
Type:
Small organic molecule
Emp. Form.:
C31H27FN4O4S
Mol. Mass.:
570.634
SMILES:
NCc1ccc(cc1-c1cccc(c1)C(=O)Nc1ccc(SCC2CCOC2=O)cc1)C(=O)Nc1ccncc1F
: