Target
Potassium-transporting ATPase alpha chain 1
Ligand
BDBM174837
Substrate
Meas. Tech.
High Throughput Screening Assay
pH
7.4±n/a
Temperature
310.15±n/a K
IC50
>100000±n/a nM
Comments
extracted
Citation
 Xie, ZShapiro, JISi, SZhang, Z Na/K-ATPase ligands, ouabain antagonists, assays and uses thereof US Patent  US9114126 Publication Date 8/25/2015 
Target
Name:
Potassium-transporting ATPase alpha chain 1
Synonyms:
ATP4A Gastric H(+)/K(+) ATPase subunit alpha Na/K-ATPase Potassium-transporting ATPase alpha chain 1 | Proton pump
Type:
Enzyme
Mol. Mass.:
114279.23
Organism:
Sus scrofa (Pig)
Description:
P19156
Residue:
1034
  
Inhibitor
Name:
BDBM174837
Synonyms:
US9114126, C-017
Type:
Small organic molecule
Emp. Form.:
C17H16O6
Mol. Mass.:
316.3053
SMILES:
COc1ccc2oc3cc(OC)c(OC)c(OC)c3c(=O)c2c1
: