Target
Mast/stem cell growth factor receptor Kit
Ligand
BDBM174926
Substrate
Meas. Tech.
Biochemical Assay
pH
7.5±n/a
IC50
>100±n/a nM
Comments
extracted
Citation
 Zhang, JIbrahim, PNBremer, RSpevak, WCho, H Compounds and methods for kinase modulation, and indications therefor US Patent  US9096593 Publication Date 8/4/2015 
Target
Name:
Mast/stem cell growth factor receptor Kit
Synonyms:
CD117 antigen KIT Mast/stem cell growth factor receptor Kit (cKIT) Proto-oncogene tyrosine-protein kinase Kit Stem cell growth factor receptor Tyrosine-protein kinase Kit c-kit v-kit Hardy-Zuckerman 4 feline sarcoma viral oncogene homolog
Type:
Protein
Mol. Mass.:
109869.37
Organism:
Homo sapiens (Human)
Description:
P10721
Residue:
976
  
Inhibitor
Name:
BDBM174926
Synonyms:
US9096593, P-2202
Type:
Small organic molecule
Emp. Form.:
C23H23F2N5O2S
Mol. Mass.:
471.523
SMILES:
CCS(=O)(=O)Nc1cc(F)cc(CNc2ccc(Cc3c[nH]c4ncc(C)cc34)c(F)n2)c1
: