Target
Receptor-type tyrosine-protein kinase FLT3
Ligand
BDBM174930
Substrate
Meas. Tech.
Biochemical Assay
pH
7.5±n/a
Temperature
298.15±n/a K
IC50
<100±n/a nM
Comments
extracted
Citation
 Zhang, JIbrahim, PNBremer, RSpevak, WCho, H Compounds and methods for kinase modulation, and indications therefor US Patent  US9096593 Publication Date 8/4/2015 
Target
Name:
Receptor-type tyrosine-protein kinase FLT3
Synonyms:
CD135 FL cytokine receptor FLK2 FLT3 Fetal liver kinase-2 Fms-like tyrosine kinase 3 (Flt-3) STK-1 Stem cell tyrosine kinase 1
Type:
Enzyme
Mol. Mass.:
112888.62
Organism:
Homo sapiens (Human)
Description:
P36888
Residue:
993
  
Inhibitor
Name:
BDBM174930
Synonyms:
US9096593, P-2030
Type:
Small organic molecule
Emp. Form.:
C21H20FN5O2
Mol. Mass.:
393.4142
SMILES:
COc1cnc2[nH]cc(Cc3ccc(NCc4ccc(OC)nc4)nc3F)c2c1
: