Target
Cytochrome P450 3A4
Ligand
BDBM174946
Substrate
US9096593, 7-Benzyloxy-4-trifluoromethylcoumarin (BFC)
Meas. Tech.
Inhibition Enzyme Assay
IC50
5000±n/a nM
Citation
 Zhang, JIbrahim, PNBremer, RSpevak, WCho, H Compounds and methods for kinase modulation, and indications therefor US Patent  US9096593 Publication Date 8/4/2015 
Target
Name:
Cytochrome P450 3A4
Synonyms:
Albendazole monooxygenase CP3A4_HUMAN CYP3A4 CYPIIIA4 Cytochrome P450 3A4 (CYP3A4) Nifedipine oxidase Taurochenodeoxycholate 6-alpha-hydroxylase
Type:
Enzyme
Mol. Mass.:
57349.57
Organism:
Homo sapiens (Human)
Description:
Residue:
503
  
Inhibitor
Name:
BDBM174946
Synonyms:
US9096593, P-2045
Type:
Small organic molecule
Emp. Form.:
C20H18FN5O
Mol. Mass.:
363.3882
SMILES:
COc1ncccc1CNc1ccc(Cc2c[nH]c3ncccc23)c(F)n1
:
Substrate
Name:
BDBM21150
Synonyms:
7-(benzyloxy)-4-(trifluoromethyl)-2H-chromen-2-one 7-benzyloxy-4-trifluoromethylcoumarin | BFC
Type:
Small organic molecule
Emp. Form.:
C17H11F3O3
Mol. Mass.:
320.2626
SMILES:
FC(F)(F)c1cc(=O)oc2cc(OCc3ccccc3)ccc12
: