Target
3-hydroxy-3-methylglutaryl-coenzyme A reductase
Ligand
BDBM50432564
Substrate
Meas. Tech.
Reductase Activity Assay
pH
7.4±n/a
IC50
36.5±5.3 nM
Comments
extracted
Citation
 Lin, JChen, CFang, JChen, JChern, TWei, T Dual action inhibitors against histone deacetylases and 3-hydroxy-3-methylglutaryl coenzyme a reductase US Patent  US9115116 Publication Date 8/25/2015 
Target
Name:
3-hydroxy-3-methylglutaryl-coenzyme A reductase
Synonyms:
3-hydroxy-3-methylglutaryl-coenzyme A (HMG-CoA) reductase HMDH_HUMAN HMG-CoA reductase (HMGR) | HMGCR
Type:
Enzyme
Mol. Mass.:
97477.10
Organism:
Homo sapiens (Human)
Description:
P04035
Residue:
888
  
Inhibitor
Name:
BDBM50432564
Synonyms:
CHEMBL2347010 | US9115116, 8a
Type:
Small organic molecule
Emp. Form.:
C41H61N5O7Si
Mol. Mass.:
764.0378
SMILES:
C[C@@H]1C[C@H](OC(=O)Nc2ccc(cc2)-c2cn(CCCCCCC(=O)NO)nn2)[C@@H]2[C@@H](CC[C@@H]3C[C@H](CC(=O)O3)O[Si](C)(C)C(C)(C)C)[C@@H](C)C=CC2=C1
: