Target
ALK tyrosine kinase receptor
Ligand
BDBM175251
Substrate
Meas. Tech.
In Vitro Inhibition Assay
IC50
0.5±n/a nM
Citation
 Carry, JChatreaux, FDeprets, SDuclos, OLeroy, VMallart, SMelon-Manguer, DMendez-Perez, MVergne, F Thienopyrimidine derivatives, processes for the preparation thereof and therapeutic uses thereof US Patent  US9115140 Publication Date 8/25/2015 
Target
Name:
ALK tyrosine kinase receptor
Synonyms:
ALK ALK_HUMAN CD_antigen: CD246
Type:
Protein
Mol. Mass.:
176453.10
Organism:
Homo sapiens (Human)
Description:
Q9UM73
Residue:
1620
  
Inhibitor
Name:
BDBM175251
Synonyms:
US9115140, I-123
Type:
Small organic molecule
Emp. Form.:
C27H30F3N7O2S
Mol. Mass.:
573.633
SMILES:
CCN1CCC(CC1)c1cc(Nc2ncc3sc(C(N)=O)c(-c4ccccc4OC(F)(F)F)c3n2)n(n1)C(C)C
: