Target
ALK tyrosine kinase receptor [L1196M]
Ligand
BDBM175252
Substrate
Meas. Tech.
In Vitro Inhibition Assay
IC50
54±0 nM
Citation
 Carry, JChatreaux, FDeprets, SDuclos, OLeroy, VMallart, SMelon-Manguer, DMendez-Perez, MVergne, F Thienopyrimidine derivatives, processes for the preparation thereof and therapeutic uses thereof US Patent  US9115140 Publication Date 8/25/2015 
Target
Name:
ALK tyrosine kinase receptor [L1196M]
Synonyms:
ALK ALK tyrosine kinase receptor (ALK) (L1196M) ALK tyrosine kinase receptor (L1196M) Anaplastic lymphoma kinase L1196M (ALK L1196M) | Tyrosine-protein kinase receptor [L1196M]
Type:
Mol. Mass.:
176471.13
Organism:
Homo sapiens (Human)
Description:
Q9UM73[L1196M]
Residue:
1620
  
Inhibitor
Name:
BDBM175252
Synonyms:
US9115140, I-127
Type:
Small organic molecule
Emp. Form.:
C27H26N6O3S
Mol. Mass.:
514.599
SMILES:
COc1ccccc1-c1c(sc2cnc(Nc3ccc(cc3OC(C)C)-c3cnn(C)c3)nc12)C(N)=O
: