Target
Tyrosinase
Ligand
BDBM175265
Substrate
Meas. Tech.
Tyrosinase Activity
pH
6.8±n/a
IC50
2.7656e+5±n/a nM
Comments
extracted
Citation
 Ismail, TShafi, SSrinivas, JSarkar, DQurishi, YKhazir, JAlam, MSKumar, HM Synthesis and tyrosinase inhibition activity of trans-stilbene derivatives. Bioorg Chem 64:97-102 (2016)  
Target
Name:
Tyrosinase
Synonyms:
TYRO_MOUSE | Tyr
Type:
Protein
Mol. Mass.:
60600.74
Organism:
Mus musculus (Mouse)
Description:
Residue:
533
  
Inhibitor
Name:
BDBM175265
Synonyms:
Trans-1-Bromo-4-styrylbenzene (4)
Type:
Small organic molecule
Emp. Form.:
C14H11Br
Mol. Mass.:
259.141
SMILES:
Brc1ccc(\C=C/c2ccccc2)cc1
: