Target
Protein Nef
Ligand
BDBM288060
Substrate
Meas. Tech.
Measurement of Antiviral (HIV-1) Activity
Temperature
298.15±n/a K
EC50
3.50±n/a nM
Comments
extracted
Citation
 Miyazaki, SIsoshima, HOshita, KKawashita, SNagahashi, NTerashita, M Substituted spiropyrido[1,2-a]pyrazine derivative and medicinal use thereof as HIV integrase inhibitor US Patent  US10087178 Publication Date 10/2/2018 
Target
Name:
Protein Nef
Synonyms:
3ORF HIV-1 Nef Negative factor nef
Type:
C-terminal core protein
Mol. Mass.:
23340.47
Organism:
Human immunodeficiency virus type 1 (isolate BRU/LAI group M subtype B)
Description:
P03406
Residue:
206
  
Inhibitor
Name:
BDBM288060
Synonyms:
N-(2,4-difluorobenzyl)-2'- ethyl-9'-hydroxy-cis-3- methoxy-1',8'-dioxo- 1',2',3',8'- tetrahydrospiro[cyclobutane- 1,4'-pyrido[1,2-a]pyrazine]- 7'-carboxamide hydrochloride | US10087178, Example S20
Type:
Small organic molecule
Emp. Form.:
C22H23F2N3O5
Mol. Mass.:
447.4319
SMILES:
CCN1C[C@]2(C[C@@H](C2)OC)n2cc(C(=O)NCc3ccc(F)cc3F)c(=O)c(O)c2C1=O
: