Target
Protein Nef
Ligand
BDBM288088
Substrate
Meas. Tech.
Measurement of Antiviral (HIV-1) Activity
Temperature
298.15±n/a K
EC50
4.30±n/a nM
Comments
extracted
Citation
 Miyazaki, SIsoshima, HOshita, KKawashita, SNagahashi, NTerashita, M Substituted spiropyrido[1,2-a]pyrazine derivative and medicinal use thereof as HIV integrase inhibitor US Patent  US10087178 Publication Date 10/2/2018 
Target
Name:
Protein Nef
Synonyms:
3ORF HIV-1 Nef Negative factor nef
Type:
C-terminal core protein
Mol. Mass.:
23340.47
Organism:
Human immunodeficiency virus type 1 (isolate BRU/LAI group M subtype B)
Description:
P03406
Residue:
206
  
Inhibitor
Name:
BDBM288088
Synonyms:
N-(3-chloro-2-fluorobenzyl)- cis-3-(ethoxymethyl)-2'- ethyl-9'-hydroxy-1',8'- dioxo-1',2',3',8'- tetrahydrospiro[cyclobutane- 1,4'-pyrido[1,2-a]pyrazine]- 7'-carboxamide hydrochloride | US10087178, Example S48
Type:
Small organic molecule
Emp. Form.:
C24H27ClFN3O5
Mol. Mass.:
491.94
SMILES:
CCOC[C@H]1C[C@@]2(C1)CN(CC)C(=O)c1c(O)c(=O)c(cn21)C(=O)NCc1cccc(Cl)c1F
: