Target
Protein Nef
Ligand
BDBM288092
Substrate
Meas. Tech.
Measurement of Antiviral (HIV-1) Activity
Temperature
298.15±n/a K
EC50
3.50±n/a nM
Comments
extracted
Citation
 Miyazaki, SIsoshima, HOshita, KKawashita, SNagahashi, NTerashita, M Substituted spiropyrido[1,2-a]pyrazine derivative and medicinal use thereof as HIV integrase inhibitor US Patent  US10087178 Publication Date 10/2/2018 
Target
Name:
Protein Nef
Synonyms:
3ORF HIV-1 Nef Negative factor nef
Type:
C-terminal core protein
Mol. Mass.:
23340.47
Organism:
Human immunodeficiency virus type 1 (isolate BRU/LAI group M subtype B)
Description:
P03406
Residue:
206
  
Inhibitor
Name:
BDBM288092
Synonyms:
N-(2,4-difluorobenzyl)-9'- hydroxy-2'-isopropyl-trans- 3-methoxy-1',8'-dioxo- 1',2',4',8'- tetrahydrospiro[cyclobutane- 1,3'-pyrido[1,2-a]pyrazine]- 7'-carboxamide hydrochloride | US10087178, Example S52
Type:
Small organic molecule
Emp. Form.:
C23H25F2N3O5
Mol. Mass.:
461.4585
SMILES:
CO[C@H]1C[C@]2(C1)Cn1cc(C(=O)NCc3ccc(F)cc3F)c(=O)c(O)c1C(=O)N2C(C)C
: